Serverless Data Processing with Dataflow - Writing an ETL pipeline using Apache Beam and Dataflow (Java) Reviews
8179 reviews
Deepak Kumar P. · Reviewed over 1 year ago
Raghavendra V. · Reviewed over 1 year ago
Son L. · Reviewed over 1 year ago
why is it necessary to do the same thing using Java as well. worst lab, worst customer support, everything is worst Worst lab, each & every time I am getting build failure erros, even though i re ran maven clean install Maven it's not working here. Lab name is: Serverless Data Processing with Dataflow - Writing an ETL pipeline using Apache Beam and Cloud Dataflow (Java) Module name is: Serverless Data Processing with Dataflow: Develop pipelines. Sub Module Name: Beam Concepts Overview Course: GCP Professional Data engineer. FYI: I am doing my labs on my personal laptop with Incognito Mode. module Name: Serverless Data Processing with Dataflow - Writing an ETL pipeline using Apache Beam and Cloud Dataflow (Java) Sub Module: Beam concepts Review I was getting an error for lab part1: Task 3, and task 6 as well after doing the same thing again, & again i.e mvn clean install The errror is ------------------------------------------------------------------------ [INFO] BUILD FAILURE [INFO] ------------------------------------------------------------------------ [INFO] Total time: 01:11 min [INFO] Finished at: 2024-04-30T06:55:37+00:00 [INFO] Final Memory: 53M/98M [INFO] ------------------------------------------------------------------------ [ERROR] Failed to execute goal org.codehaus.mojo:exec-maven-plugin:3.1.0:java (default-cli) on project advanced-dataflow-lab-1-solution: An exception occurred while executing the Java class. Table reference is not in [project_id]:[dataset_id].[table_id] format: <YOUR-PROJECT-ID>:logs.logs -> [Help 1] [ERROR] [ERROR] To see the full stack trace of the errors, re-run Maven with the -e switch. [ERROR] Re-run Maven using the -X switch to enable full debug logging. [ERROR] [ERROR] For more information about the errors and possible solutions, please read the following articles: [ERROR] [Help 1] http://cwiki.apache.org/confluence/display/MAVEN/MojoExecutionException worst customer support Worst customer support team
Gaurav M. · Reviewed over 1 year ago
Joe C. · Reviewed over 1 year ago
Jaroslav L. · Reviewed over 1 year ago
Emmanuel S. · Reviewed over 1 year ago
h purna koteswara samrat p. · Reviewed over 1 year ago
Prentice B. · Reviewed over 1 year ago
Eva S. · Reviewed over 1 year ago
Leandro S. · Reviewed over 1 year ago
Difficult to understand, unable to follow the steps.
Partha P. · Reviewed over 1 year ago
Zhou S. · Reviewed over 1 year ago
lab done hjiiuuiui
Rafi S. · Reviewed over 1 year ago
Partha P. · Reviewed over 1 year ago
Kishor P. · Reviewed over 1 year ago
Errors on the Execute Command. Hence not able to complete the Lab. Error occurs even with using the Solution directly. Had to hard code the Project Id in the input/output variables to make it work
Pramod K. · Reviewed over 1 year ago
Errors on the Execute Command. Hence not able to complete the Lab. Error occurs even with using the Solution directly.
Pramod K. · Reviewed over 1 year ago
unable to do it, online ide not working (waited 10 minutes, vm was up and running after 2 minutes)
Diego C. · Reviewed over 1 year ago
Diego C. · Reviewed over 1 year ago
schema.json part does not work at all
Filip P. · Reviewed over 1 year ago
THe provided IP with the url does not work
Filip P. · Reviewed over 1 year ago
VIJAYAKUMAR N. · Reviewed over 1 year ago
Francisco Jose G. · Reviewed over 1 year ago
Kishore T. · Reviewed over 1 year ago
We do not ensure the published reviews originate from consumers who have purchased or used the products. Reviews are not verified by Google.