关于“Serverless Data Processing with Dataflow - Writing an ETL pipeline using Apache Beam and Dataflow (Java)”的评价
正在加载…
未找到任何结果。

在 Google Cloud 控制台中运用您的技能

关于“Serverless Data Processing with Dataflow - Writing an ETL pipeline using Apache Beam and Dataflow (Java)”的评价

8179 条评价

Deepak Kumar P. · 已于 over 1 year前审核

Raghavendra V. · 已于 over 1 year前审核

Son L. · 已于 over 1 year前审核

why is it necessary to do the same thing using Java as well. worst lab, worst customer support, everything is worst Worst lab, each & every time I am getting build failure erros, even though i re ran maven clean install Maven it's not working here. Lab name is: Serverless Data Processing with Dataflow - Writing an ETL pipeline using Apache Beam and Cloud Dataflow (Java) Module name is: Serverless Data Processing with Dataflow: Develop pipelines. Sub Module Name: Beam Concepts Overview Course: GCP Professional Data engineer. FYI: I am doing my labs on my personal laptop with Incognito Mode. module Name: Serverless Data Processing with Dataflow - Writing an ETL pipeline using Apache Beam and Cloud Dataflow (Java) Sub Module: Beam concepts Review I was getting an error for lab part1: Task 3, and task 6 as well after doing the same thing again, & again i.e mvn clean install The errror is ------------------------------------------------------------------------ [INFO] BUILD FAILURE [INFO] ------------------------------------------------------------------------ [INFO] Total time: 01:11 min [INFO] Finished at: 2024-04-30T06:55:37+00:00 [INFO] Final Memory: 53M/98M [INFO] ------------------------------------------------------------------------ [ERROR] Failed to execute goal org.codehaus.mojo:exec-maven-plugin:3.1.0:java (default-cli) on project advanced-dataflow-lab-1-solution: An exception occurred while executing the Java class. Table reference is not in [project_id]:[dataset_id].[table_id] format: <YOUR-PROJECT-ID>:logs.logs -> [Help 1] [ERROR] [ERROR] To see the full stack trace of the errors, re-run Maven with the -e switch. [ERROR] Re-run Maven using the -X switch to enable full debug logging. [ERROR] [ERROR] For more information about the errors and possible solutions, please read the following articles: [ERROR] [Help 1] http://cwiki.apache.org/confluence/display/MAVEN/MojoExecutionException worst customer support Worst customer support team

Gaurav M. · 已于 over 1 year前审核

Joe C. · 已于 over 1 year前审核

Jaroslav L. · 已于 over 1 year前审核

Emmanuel S. · 已于 over 1 year前审核

h purna koteswara samrat p. · 已于 over 1 year前审核

Prentice B. · 已于 over 1 year前审核

Eva S. · 已于 over 1 year前审核

Leandro S. · 已于 over 1 year前审核

Difficult to understand, unable to follow the steps.

Partha P. · 已于 over 1 year前审核

Zhou S. · 已于 over 1 year前审核

lab done hjiiuuiui

Rafi S. · 已于 over 1 year前审核

Partha P. · 已于 over 1 year前审核

Kishor P. · 已于 over 1 year前审核

Errors on the Execute Command. Hence not able to complete the Lab. Error occurs even with using the Solution directly. Had to hard code the Project Id in the input/output variables to make it work

Pramod K. · 已于 over 1 year前审核

Errors on the Execute Command. Hence not able to complete the Lab. Error occurs even with using the Solution directly.

Pramod K. · 已于 over 1 year前审核

unable to do it, online ide not working (waited 10 minutes, vm was up and running after 2 minutes)

Diego C. · 已于 over 1 year前审核

Diego C. · 已于 over 1 year前审核

schema.json part does not work at all

Filip P. · 已于 over 1 year前审核

THe provided IP with the url does not work

Filip P. · 已于 over 1 year前审核

VIJAYAKUMAR N. · 已于 over 1 year前审核

Francisco Jose G. · 已于 over 1 year前审核

Kishore T. · 已于 over 1 year前审核

我们无法确保发布的评价来自已购买或已使用产品的消费者。评价未经 Google 核实。