关于“Serverless Data Processing with Dataflow - Custom Dataflow Flex Templates (Java)”的评价
正在加载…
未找到任何结果。

在 Google Cloud 控制台中运用您的技能

关于“Serverless Data Processing with Dataflow - Custom Dataflow Flex Templates (Java)”的评价

3049 条评价

JOSUE R. · 已于 about 3 years前审核

JOSUE R. · 已于 about 3 years前审核

sivaranjani s. · 已于 about 3 years前审核

worst lab, tried everything as per the steps but the last task "check my progress" never goes to success/green and mark my lab as completed.

Amit M. · 已于 about 3 years前审核

Diana Carolina F. · 已于 about 3 years前审核

unable to get it to score !!!

joseph k. · 已于 about 3 years前审核

Hederson S. · 已于 about 3 years前审核

Oleksandra S. · 已于 about 3 years前审核

Oleksandra S. · 已于 about 3 years前审核

Christian C. · 已于 about 3 years前审核

Diana Carolina F. · 已于 about 3 years前审核

unable to get it to score !!!

joseph k. · 已于 about 3 years前审核

Diana Carolina F. · 已于 about 3 years前审核

Hederson S. · 已于 about 3 years前审核

last step will not give credit even after job completion.

Christopher R. · 已于 about 3 years前审核

unable to get it to score !!!

joseph k. · 已于 about 3 years前审核

unable to get it to score !!!

joseph k. · 已于 about 3 years前审核

I got erorr Then execute the actual build. This will tar up the entire directory including the Dockerfile with instructions on what to actually build, upload it to the service, build a container, and push that container to Google Container Registry in your project for future use. export TEMPLATE_IMAGE="gcr.io/$PROJECT_ID/my-pipeline:latest" gcloud builds submit --tag $TEMPLATE_IMAGE . INFO[0000] Executing 0 build triggers error building image: error building stage: failed to optimize instructions: failed to get files used from context: failed to get fileinfo for /workspace/target/advanced-dataflow-lab-2-solution-1.0.jar: lstat /workspace/target/advanced-dataflow-lab-2-solution-1.0.jar: no such file or directory ERROR ERROR: build step 0 "gcr.io/kaniko-project/executor:latest" failed: step exited with non-zero status: 1 -------------------------------------------------------------------------------------------------------------------------------------------------- BUILD FAILURE: Build step failure: build step 0 "gcr.io/kaniko-project/executor:latest" failed: step exited with non-zero status: 1 ERROR: (gcloud.builds.submit) build b03f99ac-dc8a-4f41-83d2-c0243635a75c completed with status "FAILURE" theia@fa3c6fa56b0c:/home/project/training-data-analyst/quests/dataflow/2_Branching_Pipelines/labs$

Joon K. · 已于 about 3 years前审核

Ramakoti K. · 已于 about 3 years前审核

Prasanna V. · 已于 about 3 years前审核

Vijayendra G. · 已于 about 3 years前审核

Cesar G. · 已于 about 3 years前审核

Rakesh R. · 已于 about 3 years前审核

Vinícius R. · 已于 about 3 years前审核

Johan D. · 已于 about 3 years前审核

我们无法确保发布的评价来自已购买或已使用产品的消费者。评价未经 Google 核实。