Serverless Data Processing with Dataflow - Custom Dataflow Flex Templates (Java) Reviews
3049 reviews
JOSUE R. · Reviewed около 3 лет ago
JOSUE R. · Reviewed около 3 лет ago
sivaranjani s. · Reviewed около 3 лет ago
worst lab, tried everything as per the steps but the last task "check my progress" never goes to success/green and mark my lab as completed.
Amit M. · Reviewed около 3 лет ago
Diana Carolina F. · Reviewed около 3 лет ago
unable to get it to score !!!
joseph k. · Reviewed около 3 лет ago
Hederson S. · Reviewed около 3 лет ago
Oleksandra S. · Reviewed около 3 лет ago
Oleksandra S. · Reviewed около 3 лет ago
Christian C. · Reviewed около 3 лет ago
Diana Carolina F. · Reviewed около 3 лет ago
unable to get it to score !!!
joseph k. · Reviewed около 3 лет ago
Diana Carolina F. · Reviewed около 3 лет ago
Hederson S. · Reviewed около 3 лет ago
last step will not give credit even after job completion.
Christopher R. · Reviewed около 3 лет ago
unable to get it to score !!!
joseph k. · Reviewed около 3 лет ago
unable to get it to score !!!
joseph k. · Reviewed около 3 лет ago
I got erorr Then execute the actual build. This will tar up the entire directory including the Dockerfile with instructions on what to actually build, upload it to the service, build a container, and push that container to Google Container Registry in your project for future use. export TEMPLATE_IMAGE="gcr.io/$PROJECT_ID/my-pipeline:latest" gcloud builds submit --tag $TEMPLATE_IMAGE . INFO[0000] Executing 0 build triggers error building image: error building stage: failed to optimize instructions: failed to get files used from context: failed to get fileinfo for /workspace/target/advanced-dataflow-lab-2-solution-1.0.jar: lstat /workspace/target/advanced-dataflow-lab-2-solution-1.0.jar: no such file or directory ERROR ERROR: build step 0 "gcr.io/kaniko-project/executor:latest" failed: step exited with non-zero status: 1 -------------------------------------------------------------------------------------------------------------------------------------------------- BUILD FAILURE: Build step failure: build step 0 "gcr.io/kaniko-project/executor:latest" failed: step exited with non-zero status: 1 ERROR: (gcloud.builds.submit) build b03f99ac-dc8a-4f41-83d2-c0243635a75c completed with status "FAILURE" theia@fa3c6fa56b0c:/home/project/training-data-analyst/quests/dataflow/2_Branching_Pipelines/labs$
Joon K. · Reviewed около 3 лет ago
Ramakoti K. · Reviewed около 3 лет ago
Prasanna V. · Reviewed около 3 лет ago
Vijayendra G. · Reviewed около 3 лет ago
Cesar G. · Reviewed около 3 лет ago
Rakesh R. · Reviewed около 3 лет ago
Vinícius R. · Reviewed около 3 лет ago
Johan D. · Reviewed около 3 лет ago
We do not ensure the published reviews originate from consumers who have purchased or used the products. Reviews are not verified by Google.