Processamento de dados sem servidor com o Dataflow: modelos Flex personalizados do Dataflow (Java) avaliações
3049 avaliações
JOSUE R. · Revisado há about 3 years
JOSUE R. · Revisado há about 3 years
sivaranjani s. · Revisado há about 3 years
worst lab, tried everything as per the steps but the last task "check my progress" never goes to success/green and mark my lab as completed.
Amit M. · Revisado há about 3 years
Diana Carolina F. · Revisado há about 3 years
unable to get it to score !!!
joseph k. · Revisado há about 3 years
Hederson S. · Revisado há about 3 years
Oleksandra S. · Revisado há about 3 years
Oleksandra S. · Revisado há about 3 years
Christian C. · Revisado há about 3 years
Diana Carolina F. · Revisado há about 3 years
unable to get it to score !!!
joseph k. · Revisado há about 3 years
Diana Carolina F. · Revisado há about 3 years
Hederson S. · Revisado há about 3 years
last step will not give credit even after job completion.
Christopher R. · Revisado há about 3 years
unable to get it to score !!!
joseph k. · Revisado há about 3 years
unable to get it to score !!!
joseph k. · Revisado há about 3 years
I got erorr Then execute the actual build. This will tar up the entire directory including the Dockerfile with instructions on what to actually build, upload it to the service, build a container, and push that container to Google Container Registry in your project for future use. export TEMPLATE_IMAGE="gcr.io/$PROJECT_ID/my-pipeline:latest" gcloud builds submit --tag $TEMPLATE_IMAGE . INFO[0000] Executing 0 build triggers error building image: error building stage: failed to optimize instructions: failed to get files used from context: failed to get fileinfo for /workspace/target/advanced-dataflow-lab-2-solution-1.0.jar: lstat /workspace/target/advanced-dataflow-lab-2-solution-1.0.jar: no such file or directory ERROR ERROR: build step 0 "gcr.io/kaniko-project/executor:latest" failed: step exited with non-zero status: 1 -------------------------------------------------------------------------------------------------------------------------------------------------- BUILD FAILURE: Build step failure: build step 0 "gcr.io/kaniko-project/executor:latest" failed: step exited with non-zero status: 1 ERROR: (gcloud.builds.submit) build b03f99ac-dc8a-4f41-83d2-c0243635a75c completed with status "FAILURE" theia@fa3c6fa56b0c:/home/project/training-data-analyst/quests/dataflow/2_Branching_Pipelines/labs$
Joon K. · Revisado há about 3 years
Ramakoti K. · Revisado há about 3 years
Prasanna V. · Revisado há about 3 years
Vijayendra G. · Revisado há about 3 years
Cesar G. · Revisado há about 3 years
Rakesh R. · Revisado há about 3 years
Vinícius R. · Revisado há about 3 years
Johan D. · Revisado há about 3 years
Não garantimos que as avaliações publicadas sejam de consumidores que compraram ou usaram os produtos. As avaliações não são verificadas pelo Google.