리뷰 Serverless Data Processing with Dataflow - Custom Dataflow Flex Templates (Java)개
로드 중...
검색 결과가 없습니다.

Google Cloud 콘솔에서 기술 적용

리뷰 Serverless Data Processing with Dataflow - Custom Dataflow Flex Templates (Java)개

리뷰 3049개

JOSUE R. · 대략 3년 전에 리뷰됨

JOSUE R. · 대략 3년 전에 리뷰됨

sivaranjani s. · 대략 3년 전에 리뷰됨

worst lab, tried everything as per the steps but the last task "check my progress" never goes to success/green and mark my lab as completed.

Amit M. · 대략 3년 전에 리뷰됨

Diana Carolina F. · 대략 3년 전에 리뷰됨

unable to get it to score !!!

joseph k. · 대략 3년 전에 리뷰됨

Hederson S. · 대략 3년 전에 리뷰됨

Oleksandra S. · 대략 3년 전에 리뷰됨

Oleksandra S. · 대략 3년 전에 리뷰됨

Christian C. · 대략 3년 전에 리뷰됨

Diana Carolina F. · 대략 3년 전에 리뷰됨

unable to get it to score !!!

joseph k. · 대략 3년 전에 리뷰됨

Diana Carolina F. · 대략 3년 전에 리뷰됨

Hederson S. · 대략 3년 전에 리뷰됨

last step will not give credit even after job completion.

Christopher R. · 대략 3년 전에 리뷰됨

unable to get it to score !!!

joseph k. · 대략 3년 전에 리뷰됨

unable to get it to score !!!

joseph k. · 대략 3년 전에 리뷰됨

I got erorr Then execute the actual build. This will tar up the entire directory including the Dockerfile with instructions on what to actually build, upload it to the service, build a container, and push that container to Google Container Registry in your project for future use. export TEMPLATE_IMAGE="gcr.io/$PROJECT_ID/my-pipeline:latest" gcloud builds submit --tag $TEMPLATE_IMAGE . INFO[0000] Executing 0 build triggers error building image: error building stage: failed to optimize instructions: failed to get files used from context: failed to get fileinfo for /workspace/target/advanced-dataflow-lab-2-solution-1.0.jar: lstat /workspace/target/advanced-dataflow-lab-2-solution-1.0.jar: no such file or directory ERROR ERROR: build step 0 "gcr.io/kaniko-project/executor:latest" failed: step exited with non-zero status: 1 -------------------------------------------------------------------------------------------------------------------------------------------------- BUILD FAILURE: Build step failure: build step 0 "gcr.io/kaniko-project/executor:latest" failed: step exited with non-zero status: 1 ERROR: (gcloud.builds.submit) build b03f99ac-dc8a-4f41-83d2-c0243635a75c completed with status "FAILURE" theia@fa3c6fa56b0c:/home/project/training-data-analyst/quests/dataflow/2_Branching_Pipelines/labs$

Joon K. · 대략 3년 전에 리뷰됨

Ramakoti K. · 대략 3년 전에 리뷰됨

Prasanna V. · 대략 3년 전에 리뷰됨

Vijayendra G. · 대략 3년 전에 리뷰됨

Cesar G. · 대략 3년 전에 리뷰됨

Rakesh R. · 대략 3년 전에 리뷰됨

Vinícius R. · 대략 3년 전에 리뷰됨

Johan D. · 대략 3년 전에 리뷰됨

Google은 게시된 리뷰가 제품을 구매 또는 사용한 소비자에 의해 작성되었음을 보증하지 않습니다. 리뷰는 Google의 인증을 거치지 않습니다.