Dataflow を使用したサーバーレスのデータ処理 - カスタム Dataflow Flex テンプレート(Java) のレビュー
3049 件のレビュー
ROJAS MONTERO JOSUE · 約3年前にレビュー済み
ROJAS MONTERO JOSUE · 約3年前にレビュー済み
srinivasan sivaranjani · 約3年前にレビュー済み
worst lab, tried everything as per the steps but the last task "check my progress" never goes to success/green and mark my lab as completed.
Mehta Amit · 約3年前にレビュー済み
Figueredo Medina Diana Carolina · 約3年前にレビュー済み
unable to get it to score !!!
kwek joseph · 約3年前にレビュー済み
Santos Hederson · 約3年前にレビュー済み
Stadnyk Oleksandra · 約3年前にレビュー済み
Stadnyk Oleksandra · 約3年前にレビュー済み
Castro Christian · 約3年前にレビュー済み
Figueredo Medina Diana Carolina · 約3年前にレビュー済み
unable to get it to score !!!
kwek joseph · 約3年前にレビュー済み
Figueredo Medina Diana Carolina · 約3年前にレビュー済み
Santos Hederson · 約3年前にレビュー済み
last step will not give credit even after job completion.
Roby Christopher · 約3年前にレビュー済み
unable to get it to score !!!
kwek joseph · 約3年前にレビュー済み
unable to get it to score !!!
kwek joseph · 約3年前にレビュー済み
I got erorr Then execute the actual build. This will tar up the entire directory including the Dockerfile with instructions on what to actually build, upload it to the service, build a container, and push that container to Google Container Registry in your project for future use. export TEMPLATE_IMAGE="gcr.io/$PROJECT_ID/my-pipeline:latest" gcloud builds submit --tag $TEMPLATE_IMAGE . INFO[0000] Executing 0 build triggers error building image: error building stage: failed to optimize instructions: failed to get files used from context: failed to get fileinfo for /workspace/target/advanced-dataflow-lab-2-solution-1.0.jar: lstat /workspace/target/advanced-dataflow-lab-2-solution-1.0.jar: no such file or directory ERROR ERROR: build step 0 "gcr.io/kaniko-project/executor:latest" failed: step exited with non-zero status: 1 -------------------------------------------------------------------------------------------------------------------------------------------------- BUILD FAILURE: Build step failure: build step 0 "gcr.io/kaniko-project/executor:latest" failed: step exited with non-zero status: 1 ERROR: (gcloud.builds.submit) build b03f99ac-dc8a-4f41-83d2-c0243635a75c completed with status "FAILURE" theia@fa3c6fa56b0c:/home/project/training-data-analyst/quests/dataflow/2_Branching_Pipelines/labs$
Kul Lee Joon · 約3年前にレビュー済み
Kunam Ramakoti · 約3年前にレビュー済み
Veerabhadraiah Prasanna · 約3年前にレビュー済み
Golla Vijayendra · 約3年前にレビュー済み
Granjeno Cesar · 約3年前にレビュー済み
R Rakesh · 約3年前にレビュー済み
Rasteiro Vinícius · 約3年前にレビュー済み
Dahlin Johan · 約3年前にレビュー済み
公開されたレビューが、製品を購入または使用した人によるものであることは保証されません。Google はこれらのレビューの検証を行っていません。