Serverless Data Processing with Dataflow - Custom Dataflow Flex Templates (Java) recensioni
3049 recensioni
JOSUE R. · Recensione inserita circa 3 anni fa
JOSUE R. · Recensione inserita circa 3 anni fa
sivaranjani s. · Recensione inserita circa 3 anni fa
worst lab, tried everything as per the steps but the last task "check my progress" never goes to success/green and mark my lab as completed.
Amit M. · Recensione inserita circa 3 anni fa
Diana Carolina F. · Recensione inserita circa 3 anni fa
unable to get it to score !!!
joseph k. · Recensione inserita circa 3 anni fa
Hederson S. · Recensione inserita circa 3 anni fa
Oleksandra S. · Recensione inserita circa 3 anni fa
Oleksandra S. · Recensione inserita circa 3 anni fa
Christian C. · Recensione inserita circa 3 anni fa
Diana Carolina F. · Recensione inserita circa 3 anni fa
unable to get it to score !!!
joseph k. · Recensione inserita circa 3 anni fa
Diana Carolina F. · Recensione inserita circa 3 anni fa
Hederson S. · Recensione inserita circa 3 anni fa
last step will not give credit even after job completion.
Christopher R. · Recensione inserita circa 3 anni fa
unable to get it to score !!!
joseph k. · Recensione inserita circa 3 anni fa
unable to get it to score !!!
joseph k. · Recensione inserita circa 3 anni fa
I got erorr Then execute the actual build. This will tar up the entire directory including the Dockerfile with instructions on what to actually build, upload it to the service, build a container, and push that container to Google Container Registry in your project for future use. export TEMPLATE_IMAGE="gcr.io/$PROJECT_ID/my-pipeline:latest" gcloud builds submit --tag $TEMPLATE_IMAGE . INFO[0000] Executing 0 build triggers error building image: error building stage: failed to optimize instructions: failed to get files used from context: failed to get fileinfo for /workspace/target/advanced-dataflow-lab-2-solution-1.0.jar: lstat /workspace/target/advanced-dataflow-lab-2-solution-1.0.jar: no such file or directory ERROR ERROR: build step 0 "gcr.io/kaniko-project/executor:latest" failed: step exited with non-zero status: 1 -------------------------------------------------------------------------------------------------------------------------------------------------- BUILD FAILURE: Build step failure: build step 0 "gcr.io/kaniko-project/executor:latest" failed: step exited with non-zero status: 1 ERROR: (gcloud.builds.submit) build b03f99ac-dc8a-4f41-83d2-c0243635a75c completed with status "FAILURE" theia@fa3c6fa56b0c:/home/project/training-data-analyst/quests/dataflow/2_Branching_Pipelines/labs$
Joon K. · Recensione inserita circa 3 anni fa
Ramakoti K. · Recensione inserita circa 3 anni fa
Prasanna V. · Recensione inserita circa 3 anni fa
Vijayendra G. · Recensione inserita circa 3 anni fa
Cesar G. · Recensione inserita circa 3 anni fa
Rakesh R. · Recensione inserita circa 3 anni fa
Vinícius R. · Recensione inserita circa 3 anni fa
Johan D. · Recensione inserita circa 3 anni fa
Non garantiamo che le recensioni pubblicate provengano da consumatori che hanno acquistato o utilizzato i prodotti. Le recensioni non sono verificate da Google.