Serverless Data Processing with Dataflow - Custom Dataflow Flex Templates (Java) Ulasan
Memuat…
Tidak ditemukan hasil.

Terapkan keterampilan Anda di Konsol Google Cloud

Serverless Data Processing with Dataflow - Custom Dataflow Flex Templates (Java) Ulasan

3049 ulasan

JOSUE R. · Diulas sekitar 3 tahun lalu

JOSUE R. · Diulas sekitar 3 tahun lalu

sivaranjani s. · Diulas sekitar 3 tahun lalu

worst lab, tried everything as per the steps but the last task "check my progress" never goes to success/green and mark my lab as completed.

Amit M. · Diulas sekitar 3 tahun lalu

Diana Carolina F. · Diulas sekitar 3 tahun lalu

unable to get it to score !!!

joseph k. · Diulas sekitar 3 tahun lalu

Hederson S. · Diulas sekitar 3 tahun lalu

Oleksandra S. · Diulas sekitar 3 tahun lalu

Oleksandra S. · Diulas sekitar 3 tahun lalu

Christian C. · Diulas sekitar 3 tahun lalu

Diana Carolina F. · Diulas sekitar 3 tahun lalu

unable to get it to score !!!

joseph k. · Diulas sekitar 3 tahun lalu

Diana Carolina F. · Diulas sekitar 3 tahun lalu

Hederson S. · Diulas sekitar 3 tahun lalu

last step will not give credit even after job completion.

Christopher R. · Diulas sekitar 3 tahun lalu

unable to get it to score !!!

joseph k. · Diulas sekitar 3 tahun lalu

unable to get it to score !!!

joseph k. · Diulas sekitar 3 tahun lalu

I got erorr Then execute the actual build. This will tar up the entire directory including the Dockerfile with instructions on what to actually build, upload it to the service, build a container, and push that container to Google Container Registry in your project for future use. export TEMPLATE_IMAGE="gcr.io/$PROJECT_ID/my-pipeline:latest" gcloud builds submit --tag $TEMPLATE_IMAGE . INFO[0000] Executing 0 build triggers error building image: error building stage: failed to optimize instructions: failed to get files used from context: failed to get fileinfo for /workspace/target/advanced-dataflow-lab-2-solution-1.0.jar: lstat /workspace/target/advanced-dataflow-lab-2-solution-1.0.jar: no such file or directory ERROR ERROR: build step 0 "gcr.io/kaniko-project/executor:latest" failed: step exited with non-zero status: 1 -------------------------------------------------------------------------------------------------------------------------------------------------- BUILD FAILURE: Build step failure: build step 0 "gcr.io/kaniko-project/executor:latest" failed: step exited with non-zero status: 1 ERROR: (gcloud.builds.submit) build b03f99ac-dc8a-4f41-83d2-c0243635a75c completed with status "FAILURE" theia@fa3c6fa56b0c:/home/project/training-data-analyst/quests/dataflow/2_Branching_Pipelines/labs$

Joon K. · Diulas sekitar 3 tahun lalu

Ramakoti K. · Diulas sekitar 3 tahun lalu

Prasanna V. · Diulas sekitar 3 tahun lalu

Vijayendra G. · Diulas sekitar 3 tahun lalu

Cesar G. · Diulas sekitar 3 tahun lalu

Rakesh R. · Diulas sekitar 3 tahun lalu

Vinícius R. · Diulas sekitar 3 tahun lalu

Johan D. · Diulas sekitar 3 tahun lalu

Kami tidak dapat memastikan bahwa ulasan yang dipublikasikan berasal dari konsumen yang telah membeli atau menggunakan produk terkait. Ulasan tidak diverifikasi oleh Google.