Serverless Data Processing with Dataflow - Custom Dataflow Flex Templates (Java) Reviews
Loading...
No results found.

Apply your skills in Google Cloud console

Serverless Data Processing with Dataflow - Custom Dataflow Flex Templates (Java) Reviews

3049 reviews

JOSUE R. · Reviewed בערך 3 שנים ago

JOSUE R. · Reviewed בערך 3 שנים ago

sivaranjani s. · Reviewed בערך 3 שנים ago

worst lab, tried everything as per the steps but the last task "check my progress" never goes to success/green and mark my lab as completed.

Amit M. · Reviewed בערך 3 שנים ago

Diana Carolina F. · Reviewed בערך 3 שנים ago

unable to get it to score !!!

joseph k. · Reviewed בערך 3 שנים ago

Hederson S. · Reviewed בערך 3 שנים ago

Oleksandra S. · Reviewed בערך 3 שנים ago

Oleksandra S. · Reviewed בערך 3 שנים ago

Christian C. · Reviewed בערך 3 שנים ago

Diana Carolina F. · Reviewed בערך 3 שנים ago

unable to get it to score !!!

joseph k. · Reviewed בערך 3 שנים ago

Diana Carolina F. · Reviewed בערך 3 שנים ago

Hederson S. · Reviewed בערך 3 שנים ago

last step will not give credit even after job completion.

Christopher R. · Reviewed בערך 3 שנים ago

unable to get it to score !!!

joseph k. · Reviewed בערך 3 שנים ago

unable to get it to score !!!

joseph k. · Reviewed בערך 3 שנים ago

I got erorr Then execute the actual build. This will tar up the entire directory including the Dockerfile with instructions on what to actually build, upload it to the service, build a container, and push that container to Google Container Registry in your project for future use. export TEMPLATE_IMAGE="gcr.io/$PROJECT_ID/my-pipeline:latest" gcloud builds submit --tag $TEMPLATE_IMAGE . INFO[0000] Executing 0 build triggers error building image: error building stage: failed to optimize instructions: failed to get files used from context: failed to get fileinfo for /workspace/target/advanced-dataflow-lab-2-solution-1.0.jar: lstat /workspace/target/advanced-dataflow-lab-2-solution-1.0.jar: no such file or directory ERROR ERROR: build step 0 "gcr.io/kaniko-project/executor:latest" failed: step exited with non-zero status: 1 -------------------------------------------------------------------------------------------------------------------------------------------------- BUILD FAILURE: Build step failure: build step 0 "gcr.io/kaniko-project/executor:latest" failed: step exited with non-zero status: 1 ERROR: (gcloud.builds.submit) build b03f99ac-dc8a-4f41-83d2-c0243635a75c completed with status "FAILURE" theia@fa3c6fa56b0c:/home/project/training-data-analyst/quests/dataflow/2_Branching_Pipelines/labs$

Joon K. · Reviewed בערך 3 שנים ago

Ramakoti K. · Reviewed בערך 3 שנים ago

Prasanna V. · Reviewed בערך 3 שנים ago

Vijayendra G. · Reviewed בערך 3 שנים ago

Cesar G. · Reviewed בערך 3 שנים ago

Rakesh R. · Reviewed בערך 3 שנים ago

Vinícius R. · Reviewed בערך 3 שנים ago

Johan D. · Reviewed בערך 3 שנים ago

We do not ensure the published reviews originate from consumers who have purchased or used the products. Reviews are not verified by Google.