Opiniones sobre Procesamiento de datos sin servidores con Dataflow: plantillas de Flex de Dataflow personalizadas (Java)
3049 opiniones
JOSUE R. · Se revisó hace alrededor de 3 años
JOSUE R. · Se revisó hace alrededor de 3 años
sivaranjani s. · Se revisó hace alrededor de 3 años
worst lab, tried everything as per the steps but the last task "check my progress" never goes to success/green and mark my lab as completed.
Amit M. · Se revisó hace alrededor de 3 años
Diana Carolina F. · Se revisó hace alrededor de 3 años
unable to get it to score !!!
joseph k. · Se revisó hace alrededor de 3 años
Hederson S. · Se revisó hace alrededor de 3 años
Oleksandra S. · Se revisó hace alrededor de 3 años
Oleksandra S. · Se revisó hace alrededor de 3 años
Christian C. · Se revisó hace alrededor de 3 años
Diana Carolina F. · Se revisó hace alrededor de 3 años
unable to get it to score !!!
joseph k. · Se revisó hace alrededor de 3 años
Diana Carolina F. · Se revisó hace alrededor de 3 años
Hederson S. · Se revisó hace alrededor de 3 años
last step will not give credit even after job completion.
Christopher R. · Se revisó hace alrededor de 3 años
unable to get it to score !!!
joseph k. · Se revisó hace alrededor de 3 años
unable to get it to score !!!
joseph k. · Se revisó hace alrededor de 3 años
I got erorr Then execute the actual build. This will tar up the entire directory including the Dockerfile with instructions on what to actually build, upload it to the service, build a container, and push that container to Google Container Registry in your project for future use. export TEMPLATE_IMAGE="gcr.io/$PROJECT_ID/my-pipeline:latest" gcloud builds submit --tag $TEMPLATE_IMAGE . INFO[0000] Executing 0 build triggers error building image: error building stage: failed to optimize instructions: failed to get files used from context: failed to get fileinfo for /workspace/target/advanced-dataflow-lab-2-solution-1.0.jar: lstat /workspace/target/advanced-dataflow-lab-2-solution-1.0.jar: no such file or directory ERROR ERROR: build step 0 "gcr.io/kaniko-project/executor:latest" failed: step exited with non-zero status: 1 -------------------------------------------------------------------------------------------------------------------------------------------------- BUILD FAILURE: Build step failure: build step 0 "gcr.io/kaniko-project/executor:latest" failed: step exited with non-zero status: 1 ERROR: (gcloud.builds.submit) build b03f99ac-dc8a-4f41-83d2-c0243635a75c completed with status "FAILURE" theia@fa3c6fa56b0c:/home/project/training-data-analyst/quests/dataflow/2_Branching_Pipelines/labs$
Joon K. · Se revisó hace alrededor de 3 años
Ramakoti K. · Se revisó hace alrededor de 3 años
Prasanna V. · Se revisó hace alrededor de 3 años
Vijayendra G. · Se revisó hace alrededor de 3 años
Cesar G. · Se revisó hace alrededor de 3 años
Rakesh R. · Se revisó hace alrededor de 3 años
Vinícius R. · Se revisó hace alrededor de 3 años
Johan D. · Se revisó hace alrededor de 3 años
No garantizamos que las opiniones publicadas provengan de consumidores que hayan comprado o utilizado los productos. Google no verifica las opiniones.