Serverless Data Processing with Dataflow - Custom Dataflow Flex Templates (Java) Rezensionen
3049 Rezensionen
JOSUE R. · Vor etwa 3 Jahre überprüft
JOSUE R. · Vor etwa 3 Jahre überprüft
sivaranjani s. · Vor etwa 3 Jahre überprüft
worst lab, tried everything as per the steps but the last task "check my progress" never goes to success/green and mark my lab as completed.
Amit M. · Vor etwa 3 Jahre überprüft
Diana Carolina F. · Vor etwa 3 Jahre überprüft
unable to get it to score !!!
joseph k. · Vor etwa 3 Jahre überprüft
Hederson S. · Vor etwa 3 Jahre überprüft
Oleksandra S. · Vor etwa 3 Jahre überprüft
Oleksandra S. · Vor etwa 3 Jahre überprüft
Christian C. · Vor etwa 3 Jahre überprüft
Diana Carolina F. · Vor etwa 3 Jahre überprüft
unable to get it to score !!!
joseph k. · Vor etwa 3 Jahre überprüft
Diana Carolina F. · Vor etwa 3 Jahre überprüft
Hederson S. · Vor etwa 3 Jahre überprüft
last step will not give credit even after job completion.
Christopher R. · Vor etwa 3 Jahre überprüft
unable to get it to score !!!
joseph k. · Vor etwa 3 Jahre überprüft
unable to get it to score !!!
joseph k. · Vor etwa 3 Jahre überprüft
I got erorr Then execute the actual build. This will tar up the entire directory including the Dockerfile with instructions on what to actually build, upload it to the service, build a container, and push that container to Google Container Registry in your project for future use. export TEMPLATE_IMAGE="gcr.io/$PROJECT_ID/my-pipeline:latest" gcloud builds submit --tag $TEMPLATE_IMAGE . INFO[0000] Executing 0 build triggers error building image: error building stage: failed to optimize instructions: failed to get files used from context: failed to get fileinfo for /workspace/target/advanced-dataflow-lab-2-solution-1.0.jar: lstat /workspace/target/advanced-dataflow-lab-2-solution-1.0.jar: no such file or directory ERROR ERROR: build step 0 "gcr.io/kaniko-project/executor:latest" failed: step exited with non-zero status: 1 -------------------------------------------------------------------------------------------------------------------------------------------------- BUILD FAILURE: Build step failure: build step 0 "gcr.io/kaniko-project/executor:latest" failed: step exited with non-zero status: 1 ERROR: (gcloud.builds.submit) build b03f99ac-dc8a-4f41-83d2-c0243635a75c completed with status "FAILURE" theia@fa3c6fa56b0c:/home/project/training-data-analyst/quests/dataflow/2_Branching_Pipelines/labs$
Joon K. · Vor etwa 3 Jahre überprüft
Ramakoti K. · Vor etwa 3 Jahre überprüft
Prasanna V. · Vor etwa 3 Jahre überprüft
Vijayendra G. · Vor etwa 3 Jahre überprüft
Cesar G. · Vor etwa 3 Jahre überprüft
Rakesh R. · Vor etwa 3 Jahre überprüft
Vinícius R. · Vor etwa 3 Jahre überprüft
Johan D. · Vor etwa 3 Jahre überprüft
Wir können nicht garantieren, dass die veröffentlichten Rezensionen von Verbrauchern stammen, die die Produkte gekauft oder genutzt haben. Die Rezensionen werden von Google nicht überprüft.